=> Bootstrap dependency digest>=20211023: found digest-20220214
===> Skipping vulnerability checks.
WARNING: No /usr/pkg/pkgdb/pkg-vulnerabilities file found.
WARNING: To fix run: `/usr/sbin/pkg_admin -K /usr/pkg/pkgdb fetch-pkg-vulnerabilities'.
===> Building for gimp-devel-2.99.18nb7
ninja: Entering directory `output'
[1/2522] Generating libgimpbase/stamp-gimpbaseenums.h with a custom command (wrapped by meson because command contains newlines)
[2/2522] Generating libgimpbase/stamp-gimpcompatenums.h with a custom command (wrapped by meson because command contains newlines)
[3/2522] Compiling C object libgimpbase/libgimpbase-3.0.so.0.9900.18.p/gimpbasetypes.c.o
[4/2522] Compiling C object libgimpbase/libgimpbase-3.0.so.0.9900.18.p/gimpchecks.c.o
[5/2522] Compiling C object libgimpbase/libgimpbase-3.0.so.0.9900.18.p/gimpchoice.c.o
[6/2522] Compiling C object libgimpbase/libgimpbase-3.0.so.0.9900.18.p/gimpcpuaccel.c.o
[7/2522] Compiling C object libgimpbase/libgimpbase-3.0.so.0.9900.18.p/gimpenv.c.o
[8/2522] Compiling C object libgimpbase/libgimpbase-3.0.so.0.9900.18.p/gimpmemsize.c.o
[9/2522] Compiling C object libgimpbase/libgimpbase-3.0.so.0.9900.18.p/gimpmetadata.c.o
[10/2522] Compiling C object libgimpbase/libgimpbase-3.0.so.0.9900.18.p/gimpparamspecs.c.o
[11/2522] Compiling C object libgimpbase/libgimpbase-3.0.so.0.9900.18.p/gimpparasite.c.o
[12/2522] Compiling C object libgimpbase/libgimpbase-3.0.so.0.9900.18.p/gimpparasiteio.c.o
[13/2522] Compiling C object libgimpbase/libgimpbase-3.0.so.0.9900.18.p/gimprectangle.c.o
[14/2522] Compiling C object libgimpbase/libgimpbase-3.0.so.0.9900.18.p/gimpsignal.c.o
[15/2522] Compiling C object libgimpbase/libgimpbase-3.0.so.0.9900.18.p/gimpunit.c.o
[16/2522] Compiling C object libgimpbase/libgimpbase-3.0.so.0.9900.18.p/gimputils.c.o
[17/2522] Compiling C object libgimpbase/libgimpbase-3.0.so.0.9900.18.p/gimpvaluearray.c.o
[18/2522] Compiling C object libgimpbase/libgimpbase-3.0.so.0.9900.18.p/gimpbase-private.c.o
[19/2522] Compiling C object libgimpbase/libgimpbase-3.0.so.0.9900.18.p/gimpprotocol.c.o
[20/2522] Compiling C object libgimpbase/libgimpbase-3.0.so.0.9900.18.p/gimpreloc.c.o
[21/2522] Compiling C object libgimpbase/libgimpbase-3.0.so.0.9900.18.p/gimpwire.c.o
[22/2522] Compiling C object libgimpbase/libgimpbase-3.0.so.0.9900.18.p/gimpbaseenums.c.o
[23/2522] Compiling C object libgimpbase/libgimpbase-3.0.so.0.9900.18.p/gimpcompatenums.c.o
[24/2522] Linking target libgimpbase/libgimpbase-3.0.so.0.9900.18
[25/2522] Generating symbol file libgimpbase/libgimpbase-3.0.so.0.9900.18.p/libgimpbase-3.0.so.0.9900.18.symbols
[26/2522] Compiling C object libgimpcolor/libgimpcolor-3.0.so.0.9900.18.p/gimpadaptivesupersample.c.o
[27/2522] Compiling C object libgimpcolor/libgimpcolor-3.0.so.0.9900.18.p/gimpbilinear.c.o
[28/2522] Compiling C object libgimpcolor/libgimpcolor-3.0.so.0.9900.18.p/gimpcairo.c.o
[29/2522] Compiling C object libgimpcolor/libgimpcolor-3.0.so.0.9900.18.p/gimpcmyk.c.o
[30/2522] Compiling C object libgimpcolor/libgimpcolor-3.0.so.0.9900.18.p/gimpcolor.c.o
[31/2522] Compiling C object libgimpcolor/libgimpcolor-3.0.so.0.9900.18.p/gimpcolor-parse.c.o
[32/2522] Compiling C object libgimpcolor/libgimpcolor-3.0.so.0.9900.18.p/gimpcolormanaged.c.o
[33/2522] Compiling C object libgimpcolor/libgimpcolor-3.0.so.0.9900.18.p/gimpcolorprofile.c.o
[34/2522] Compiling C object libgimpcolor/libgimpcolor-3.0.so.0.9900.18.p/gimpcolorspace.c.o
[35/2522] Compiling C object libgimpcolor/libgimpcolor-3.0.so.0.9900.18.p/gimpcolortransform.c.o
[36/2522] Compiling C object libgimpcolor/libgimpcolor-3.0.so.0.9900.18.p/gimphsl.c.o
[37/2522] Compiling C object libgimpcolor/libgimpcolor-3.0.so.0.9900.18.p/gimphsv.c.o
[38/2522] Compiling C object libgimpcolor/libgimpcolor-3.0.so.0.9900.18.p/gimppixbuf.c.o
[39/2522] Compiling C object libgimpcolor/libgimpcolor-3.0.so.0.9900.18.p/gimprgb-parse.c.o
[40/2522] Compiling C object libgimpcolor/libgimpcolor-3.0.so.0.9900.18.p/gimprgb.c.o
[41/2522] Compiling C object libgimpmath/libgimpmath-3.0.so.0.9900.18.p/gimpmatrix.c.o
[42/2522] Compiling C object libgimpmath/libgimpmath-3.0.so.0.9900.18.p/gimpvector.c.o
[43/2522] Linking target libgimpcolor/libgimpcolor-3.0.so.0.9900.18
[44/2522] Linking target libgimpmath/libgimpmath-3.0.so.0.9900.18
[45/2522] Generating libgimpconfig/stamp-gimpconfigenums.h with a custom command (wrapped by meson because command contains newlines)
[46/2522] Compiling C object tools/colorsvg2png.p/colorsvg2png.c.o
FAILED: tools/colorsvg2png.p/colorsvg2png.c.o 
gcc -Itools/colorsvg2png.p -Itools -I../tools -I/usr/pkg/include/glib-2.0 -I/usr/pkg/lib/glib-2.0/include -I/usr/pkg/include -I/usr/pkg/include/librsvg-2.0 -I/usr/pkg/include/gdk-pixbuf-2.0 -I/usr/pkg/include/cairo -I/usr/X11R7/include -I/usr/pkg/include/freetype2 -I/usr/pkg/include/libpng16 -I/usr/pkg/include/pixman-1 -I/usr/include -I/usr/pkg/include/gio-unix-2.0 -I/usr/pkg/include/harfbuzz -I/usr/pkg/include/python3.12 -I/usr/pkg/include/nspr -I/usr/X11R7/include/libdrm -fdiagnostics-color=always -D_FILE_OFFSET_BITS=64 -Wall -Winvalid-pch -O2 -DPNG_NO_ASSEMBLER_CODE -pthread -D_REENTRANT -MD -MQ tools/colorsvg2png.p/colorsvg2png.c.o -MF tools/colorsvg2png.p/colorsvg2png.c.o.d -o tools/colorsvg2png.p/colorsvg2png.c.o -c ../tools/colorsvg2png.c
distcc[5627] ERROR: compile ../tools/colorsvg2png.c on 10.0.20.122:3760 failed
distcc[5627] (dcc_build_somewhere) Warning: remote compilation of '../tools/colorsvg2png.c' failed, retrying locally
distcc[5627] Warning: failed to distribute ../tools/colorsvg2png.c to 10.0.20.122:3760, running locally instead
../tools/colorsvg2png.c: In function 'main':
../tools/colorsvg2png.c:28:3: error: unknown type name 'RsvgRectangle'; did you mean 'RsvgHandle'?
   28 |   RsvgRectangle      target_rect;
      |   ^~~~~~~~~~~~~
      |   RsvgHandle
../tools/colorsvg2png.c:63:14: error: request for member 'x' in something not a structure or union
   63 |   target_rect.x = target_rect.y = 0;
      |              ^
../tools/colorsvg2png.c:63:30: error: request for member 'y' in something not a structure or union
   63 |   target_rect.x = target_rect.y = 0;
      |                              ^
../tools/colorsvg2png.c:64:14: error: request for member 'width' in something not a structure or union
   64 |   target_rect.width = target_rect.height = dim;
      |              ^
../tools/colorsvg2png.c:64:34: error: request for member 'height' in something not a structure or union
   64 |   target_rect.width = target_rect.height = dim;
      |                                  ^
../tools/colorsvg2png.c:66:9: warning: implicit declaration of function 'rsvg_handle_render_document'; did you mean 'rsvg_handle_render_cairo'? [-Wimplicit-function-declaration]
   66 |   if (! rsvg_handle_render_document (handle, cr, &target_rect, NULL))
      |         ^~~~~~~~~~~~~~~~~~~~~~~~~~~
      |         rsvg_handle_render_cairo
distcc[5627] ERROR: compile ../tools/colorsvg2png.c on localhost failed
ninja: build stopped: subcommand failed.
*** Error code 1

Stop.
make[1]: stopped in /usr/pkgsrc/graphics/gimp-devel
*** Error code 1

Stop.
make: stopped in /usr/pkgsrc/graphics/gimp-devel